{"text_format":"3","workbook":"xlsx","n_sheets":5,"sheets":["bar schedule","bar weights","shape codes","template","from author"],"not_rendered":{"images":4,"macros":1,"defined_names":4},"read":"whole","date_system":"1900"}

{"sheet":"bar schedule","index":0,"n_rows":57,"n_cols":173,"rows_kept":57,"merged":[[0,1,0,11],[0,12,0,22],[1,4,4,12],[1,13,3,16],[1,17,1,18],[1,19,1,22],[2,17,2,18],[2,19,2,22],[3,17,3,18],[3,19,3,22],[4,13,4,14],[4,15,4,16],[4,17,4,18],[4,19,4,22],[5,2,5,3],[5,4,5,12],[5,13,5,14],[5,15,5,16],[5,17,5,18],[5,19,5,22],[6,2,6,3],[6,4,6,12],[6,13,6,14],[6,15,6,16],[6,17,6,18],[6,19,6,22],[7,123,10,123],[7,124,10,124],[7,125,10,125],[7,126,10,126],[7,127,10,127],[7,128,10,128],[7,129,10,129],[8,2,11,4],[8,5,11,5],[8,6,11,7],[8,8,11,8],[8,9,11,9],[8,10,11,10],[8,11,11,11],[8,12,11,12],[8,13,11,13],[8,14,11,14],[8,15,11,15],[8,16,11,16],[8,17,11,17],[8,18,11,18],[8,19,11,19],[8,20,11,20],[8,21,11,21],[8,24,8,30],[8,117,11,117],[9,24,11,24],[9,25,11,25],[9,26,11,26],[9,27,11,27],[9,28,11,28],[9,29,11,29],[9,30,11,30],[9,31,11,31],[10,60,10,61],[12,2,12,4],[13,2,13,4],[14,2,14,4],[15,2,15,4],[16,2,16,4],[17,2,17,4],[18,2,18,4],[19,2,19,4],[20,2,20,4],[21,2,21,4],[22,2,22,4],[23,2,23,4],[24,2,24,4],[25,2,25,4],[26,2,26,4],[27,2,27,4],[28,2,28,4],[29,2,29,4],[30,2,30,4],[31,2,31,4],[32,2,32,4],[33,2,33,4],[34,2,34,4],[35,2,35,4],[36,2,36,4],[37,2,37,4],[38,2,38,4],[39,3,39,9],[39,11,39,14],[39,20,39,21],[40,3,40,8],[40,11,41,17],[41,3,41,8],[42,15,42,21]]}
[null,"Version: 3.1. - FREE LITE VERSION",{"$nulls":10},"© 2010-2021 Damian Janicki"]
[{"$nulls":4},"YourSpreadsheets™\nYour Office Address Goes Here\nwww.YourSpreadsheets.co.uk\nTel: 010 1234 567890 (example only)",{"$nulls":8},"86 MARGERY STREET, LONDON",{"$nulls":3},"Status:",null,"C"]
[{"$nulls":17},"Drawing No:",null,"A1/503"]
[{"$nulls":17},"Sheet No:",null,1]
[{"$nulls":13},"Job No:",null,22190,null,"Revision:",null,"A"]
[null,null,"Section: ",null,"Grid A/1 to grid D/6",{"$nulls":8},"Prepared By:",null,"DJ",null,"Date:",null,{"$f":"TODAY()","v":"2021-05-31"}]
[null,null,"Location: ",null,"Foundations",{"$nulls":8},"Checked By:",null,"DJ",null,"Last Revised:",null,"2013-11-26",{"$nulls":23},"extra dimension is 1: horizontal 2: vertical",{"$nulls":6},{"$f":"'bar weights'!$AM$2","v":1},{"$nulls":72},"NOTE: 1 means cell input required. And 2 means that user should specify something but this is not automatically calculated/checked - and so different hatching applies in the input lengths table"]
[{"$nulls":43},"calculate extra dims",{"$nulls":5},{"$f":"'bar weights'!AL2","v":true},{"$f":"IF(AX8=TRUE,1,0)","v":1},{"$nulls":9},"the below table is for checking only",{"$nulls":62},"Colour cell A","Colour cell B","Colour cell C","Colour cell D","Colour cell E","Colour cell F","Colour cell R"]
[null,null,"Member",null,null,"Bar \nmark","Type and \nsize",null,"No. of \nMbrs","No. of \nbars in \neach","Total\nNo.","Length \nof each bar †\n[mm]","Shape\ncode","A *\n[mm]","B *\n[mm]","C *\n[mm]","D *\n[mm]","E *\n[mm]","F *\n[mm]","R *\n[mm]","Weight\n[kg]","Rev.",null,null,"FILL IN LENGTHS BELOW",{"$nulls":18},"auto jump",{"$nulls":5},{"$f":"'bar weights'!AK2","v":true},{"$f":"IF(AX9=TRUE,1,0)","v":1},{"$nulls":9},"shape code:",null,"dia:",{"$nulls":54},"Shape Code"]
[{"$nulls":24},"A *\n[mm]","B *\n[mm]","C *\n[mm]","D *\n[mm]","E *\n[mm]","F *\n[mm]","R *\n[mm]","Overwrite\nlength\n[mm]",{"$nulls":11},"popup window",{"$nulls":5},{"$f":"'bar weights'!AJ2","v":true},{"$f":"IF(AX10=TRUE,1,0)","v":1},{"$nulls":9},"AA=",null,"BB=",null,"CC=",null,"DD=",null,"EE=",null,"FF=",null,"RR="]
[{"$nulls":48},"for calculating extra dimensions in shape code 14, 15, 24, 26, 27, 28, 29, 34, 35, 36, 46","below is a guide which bends are required for which shapde code:\nREQUIRED DIMENSION IS HORIZONTAL:\nIF(OR(M13=14,M13=15) A,B -> D\nIF(OR(M13=24,M13=26,M13=29) B,D -> E\nIF(OR(M13=27,M13=28) A,D -> E\nIF(OR(M13=34,M13=35,M13=46) B,D -> F\nIF(OR(M13=36) A,E -> F\nREQUIRED DIMENSION IS DIAGONAL:\nIF(OR(M13=14,M13=15) B,D -> A\nIF(OR(M13=24,M13=26,M13=29) D,E -> B\nIF(OR(M13=27,M13=28) D,E -> A\nIF(OR(M13=34,M13=35,M13=46) D,F -> B\nIF(OR(M13=36) E,F -> A","equations taken from a separate spreadsheet. And below is a guide which case applies to which bar:\ncase 1: 14, \ncase 2: 29\ncase 3: 26, 34, 35, 46\ncase 4: 15, 27, 28, 36\ncase 5: 24 -> d2+e2=b2",{"$nulls":9},"first calculates dimensions in the second cell [typically used to pick correct P1, P2, x,q, etc], and then in the first cell [typically used for any specific length requirements given in the code e.g. B/2+max(5d,90mm)]",{"$nulls":13},"shape code:",{"$nulls":56},"for calculating tonnage per this sheet",{"$nulls":4},"this area is used for merging/unmerging rows",{"$nulls":16},"this area is for clearing entries, and undoing it",{"$nulls":18},"this area is used for refreshing conditional formatting - was simpler to just include these cells than rewritting the whole vba I had for refreshing conditional formatting in the previous version of the spreadsheet"]
[{"$nulls":34},"L","A","B","C","D","E","F","R",null,"does shape code exist in the Standrad?","column of FIRST bend required to calculate extra dimension","column of SECOND bend required to calculate extra dimension","column of extra dimension",null,"A","B","D (extra dimension, not in BS8666:2005)","angle","A (for checking)",null,"d","x","P1","r","P2 (for links with bents <150deg)","q","A","A","B","B","C","C","D","D","E","E","F","F","R","R",0,1,11,12,13,14,15,21,22,23,24,25,26,27,28,29,31,32,33,34,35,36,41,44,46,47,48,51,52,56,63,64,67,75,77,98,null,"d","r","x","P1","P2","q",null,"Total Length of bar:",{"$nulls":3},"column reference:",7,8,9,10,11,12,13,null,"total length","all bar diameters that can be used","bar lengths per sheet",null,null,137,{"$nulls":13},151,"<- column number",null,154,{"$nulls":18},173]
[null,null,"Pile Cap 01",null,null,{"v":1,"d":"01"},"H",12,10,50,500,{"$f":"AI13","v":5975},21,{"$f":"AJ13","v":2500},{"$f":"AK13","v":1000},{"$f":"AL13","v":"(2500)"},{"$f":"AM13","v":""},{"$f":"AN13","v":""},{"$f":"AO13","v":""},{"$f":"AP13","v":""},{"$f":"IF($L13=\"?\",\"?\",IF(AND(H13<>\"\",K13<>\"\",AF13<>\"\",EG13=1),K13*AF13*(H13/2)^2*PI()*0.00000785,IF(AND(H13<>\"\",K13<>\"\",L13<>\"\"),K13*L13*(H13/2)^2*PI()*0.00000785,\"\")))","v":{"v":2652.34457566462,"d":"2652.3"}},{"$nulls":3},2500,1000,2500,{"$nulls":5},{"$f":"IF(AU13>0,\"*\",\"\")","v":""},"<- formulaes in column BC",{"$f":"IF(OR(H13=\"\",M13=\"\"),\"\",IF(AF13>0,AF13,IF($M13=99,\"?\",INDEX(BW13:DF13,,MATCH(M13,$BW$12:$DF$12,0)))))","v":5975},{"$f":"IF(ISERROR(BI13),L13,IF(OR(H13=\"\",M13=\"\",AR13=0),\"\",IF(M13=99,IF(Y13=\"\",\"\",CEILING(Y13,5)),BI13)))","v":2500},{"$f":"IF(OR(H13=\"\",M13=\"\",M13=0,M13=1,AR13=0),\"\",IF(M13=99,IF(Z13=\"\",\"\",CEILING(Z13,5)),IF(OR(M13=11,M13=12),\"(\"&BK13&\")\",BK13)))","v":1000},{"$f":"IF(OR(H13=\"\",M13=\"\",M13=0,M13=1,M13=11,M13=12,M13=75,AR13=0),\"\",IF(M13=99,IF(AA13=\"\",\"\",CEILING(AA13,5)),IF(OR(M13=13,M13=14,M13=15,M13=21,M13=23,M13=24,M13=26,M13=27,M13=28,M13=29,M13=33,M13=47,M13=48,M13=51,M13=52,M13=63),\"(\"&BM13&\")\",BM13)))","v":"(2500)"},{"$f":"IF(OR(H13=\"\",AR13=0,M13=\"\",M13=0,M13=1,M13=11,M13=12,M13=13,M13=21,M13=23,M13=33,M13=67,M13=75,M13=77,AND(AB13=\"\",$AU13=4)),\"\",IF(M13=99,IF(AB13=\"\",\"\",CEILING(AB13,5)),IF(OR(M13=22,M13=31,M13=32,M13=36,M13=47,M13=48,M13=51,M13=52,M13=56,M13=63,M13=98),\"(\"&BO13&\")\",BO13)))","v":""},{"$f":"IF(OR(H13=\"\",AR13=0,AND(AC13=\"\",$AU13=5)),\"\",IF(M13=99,IF(AC13=\"\",\"\",CEILING(AC13,5)),IF(OR(M13=24,M13=26,M13=27,M13=28,M13=29,M13=36,M13=64),BQ13,IF(OR(M13=25,M13=34,M13=35,M13=41,M13=44,M13=46,M13=56),\"(\"&BQ13&\")\",\"\"))))","v":""},{"$f":"IF(OR(H13=\"\",AR13=0,AND(AD13=\"\",$AU13=6)),\"\",IF(M13=99,IF(AD13=\"\",\"\",CEILING(AD13,5)),IF(OR(M13=34,M13=35,M13=36,M13=46),BS13,IF(OR(M13=56,M13=64),\"(\"&BS13&\")\",\"\"))))","v":""},{"$f":"IF(OR(H13=\"\",AR13=0),\"\",IF(M13=99,IF(AE13=\"\",\"\",CEILING(AE13,5)),IF(OR(M13=12,M13=67),BU13,\"\")))","v":""},null,{"$f":"IF(OR(M13=\"\",M13=0,M13=1,M13=11,M13=12,M13=13,M13=14,M13=15,M13=21,M13=22,M13=23,M13=24,M13=25,M13=26,M13=27,M13=28,M13=29,M13=31,M13=32,M13=33,M13=34,M13=35,M13=36,M13=41,M13=44,M13=46,M13=47,M13=48,M13=51,M13=52,M13=56,M13=63,M13=64,M13=67,M13=75,M13=77,M13=98,M13=99),1,0)","v":1},{"$f":"IF($AY$7=1,IF(OR($M13=14,$M13=15),1,IF(OR($M13=24,$M13=26,$M13=29),2,IF(OR($M13=27,$M13=28),1,IF(OR($M13=34,$M13=35,$M13=46),2,IF($M13=36,1,\"-\"))))),\nIF(OR($M13=14,$M13=15),2,IF(OR($M13=24,$M13=26,$M13=29),4,IF(OR($M13=27,$M13=28),4,IF(OR($M13=34,$M13=35,$M13=46),4,IF($M13=36,5,\"-\"))))))","v":"-"},{"$f":"IF($AY$7=1,IF(OR($M13=14,$M13=15),2,IF(OR($M13=24,$M13=26,$M13=29),4,IF(OR($M13=27,$M13=28),4,IF(OR($M13=34,$M13=35,$M13=46),4,IF($M13=36,5,\"-\"))))),\nIF(OR($M13=14,$M13=15),4,IF(OR($M13=24,$M13=26,$M13=29),5,IF(OR($M13=27,$M13=28),5,IF(OR($M13=34,$M13=35,$M13=46),6,IF($M13=36,6,\"-\"))))))","v":"-"},{"$f":"IF($AY$7=1,IF(OR(M13=14,M13=15),4,IF(OR(M13=24,M13=26,M13=27,M13=28,M13=29),5,IF(OR(M13=34,M13=35,M13=36,M13=46),6,0))),\nIF(OR(M13=14,M13=15,M13=27,M13=28,M13=36),1,IF(OR(M13=24,M13=26,M13=29,M13=34,M13=35,M13=46),2,0)))","v":0},{"$nulls":10},24,null,85,{"$f":"IF(OR(M13=47,M13=48,M13=51,M13=56,M13=63,M13=64,M13=98),CEILING(BJ13,5),CEILING(MAX(Y13,IF(M13=1,IF(Y13<6000,6000,IF(Y13>12000,Y13,12000)),IF(M13=12,MAX(BU13+12+MAX(5*12,90),125),IF(M13=13,MAX(125,BK13/2+MAX(5*12,90)),IF(M13=33,BK13/2+BM13,IF(M13=52,120,125)))))),5))","v":2500},{"$f":"IF(OR(M13=47,M13=48),MAX(Y13,AA13,125,120),IF(OR(M13=51,M13=63),MAX(Y13,AA13,155,120),IF(M13=56,MAX(Y13,AC13,155,120),IF(M13=64,MAX(Y13,155),IF(M13=98,MAX(Y13,120),0)))))","v":0},{"$f":"IF(OR(M13=\"\",M13=0,M13=1),\"\",IF(OR(M13=15,M13=51,M13=52,M13=56),CEILING(BL13,5),IF(M13=77,BL13,CEILING(IF(OR(M13=11,M13=25,M13=75),MAX(Z13,125),IF(M13=12,MAX(Z13,BU13+12+MAX(5*12,90),125),IF(OR(M13=13,M13=33),MIN(MAX(BH13,Z13),400+2*12),IF(M13=14,MAX(Z13,BH13),MAX(Z13,120))))),5))))","v":1000},{"$f":"IF(M13=77,MAX(Z13,12),CEILING(IF(M13=15,MAX(Z13,5),IF(M13=51,MAX(Z13,AA13,155,120),IF(M13=52,MAX(Z13,AA13,125,120),IF(M13=56,MAX(Z13,AC13,155,120),0)))),5))","v":0},{"$f":"IF(M13=77,MAX(AA13,1),IF(OR(M13=\"\",M13=0,M13=1,M13=11,M13=12,M13=75),\"\",IF(OR(M13=48,M13=51,M13=52,M13=56,M13=63,M13=67,M13=98),CEILING(BN13,5),CEILING(IF(OR(M13=13,M13=33),MAX(AA13,BK13/2+MAX(5*12,90)),IF(M13=22,MIN(MAX(BH13,AA13),400+2*12),IF(M13=25,MAX(AA13,5),IF(OR(M13=14,M13=15,M13=21,M13=23,M13=24,M13=26,M13=27,M13=28,M13=29,M13=47),MAX(AA13,125),MAX(AA13,120))))),5))))","v":2500},{"$f":"IF(OR(M13=51,M13=63),MAX(AA13,155),IF(OR(M13=48,M13=52,M13=98),MAX(AA13,125),IF(M13=56,MAX(AA13,120),IF(M13=67,MAX(AA13,5),0))))","v":0},{"$f":"IF(OR(M13=\"\",M13=0,M13=1,M13=11,M13=12,M13=13,M13=21,M13=23,M13=33,M13=67,M13=75,M13=77),\"\",IF(OR(M13=29,M13=31,M13=32,M13=36,M13=47,M13=48,M13=51,M13=52,M13=63,M13=98),CEILING(BP13,5),CEILING(IF(M13=22,MAX(AB13,BM13/2+MAX(5*12,90),125),IF(OR(M13=14,M13=15,M13=24,M13=25,M13=26,M13=27,M13=28,M13=34,M13=35,M13=46),MAX(AB13,5),MAX(AB13,120))),5)))","v":""},{"$f":"CEILING(IF(OR(M13=31,M13=32,M13=36,M13=98),MAX(AB13,125),IF(M13=29,MAX(AB13,BH13),IF(OR(M13=47,M13=48,M13=51,M13=52,M13=63),BM13,0))),5)","v":0},{"$f":"IF(OR(M13=24,M13=26,M13=27,M13=28,M13=29,M13=36),CEILING(MAX(AC13,5),5),IF(OR(M13=25,M13=64),CEILING(MAX(AC13,120),5),IF(OR(M13=34,M13=35,M13=41,M13=44,M13=46),CEILING(MAX(AC13,125),5),IF(M13=56,CEILING(MAX(AC13,155),5),IF(M13=99,0,\"\")))))","v":""},0,{"$f":"IF(OR(M13=34,M13=35,M13=36,M13=46),CEILING(MAX(AD13,5),5),IF(M13=56,BQ13,IF(M13=64,CEILING(MAX(AD13,155),5),IF(M13=99,0,\"\"))))","v":""},0,{"$f":"IF(OR(M13=12,M13=67),CEILING(MAX(AE13,BF13),5),IF(M13=99,0,\"\"))","v":""},0,{"$f":"IF($M13=BW$12,CEILING(BI13,25),\"\")","v":""},{"$f":"IF($M13=BX$12,CEILING(BI13,25),\"\")","v":""},{"$f":"IF($M13=BY$12,CEILING(BI13+BK13-0.5*BF13-12,25),\"\")","v":""},{"$f":"IF($M13=BZ$12,CEILING(BI13+BK13-0.43*BU13-1.2*12,25),\"\")","v":""},{"$f":"IF($M13=CA$12,CEILING(BI13+0.57*BK13+BM13-1.6*12,25),\"\")","v":""},null,null,{"$f":"IF($M13=CD$12,CEILING(BI13+BK13+BM13-BF13-2*12,25),\"\")","v":5975},{"$f":"IF($M13=CE$12,CEILING(BI13+BK13+0.57*BM13+BO13-0.5*BF13-2.6*12,25),\"\")","v":""},{"$f":"IF($M13=CF$12,CEILING(BI13+BK13+BM13-BF13-2*12,25),\"\")","v":""},{"$nulls":47},{"$f":"IF(OR(K13=\"\",L13=\"\",L13=\"?\"),0,K13*L13/1000)","v":2987.5},6,{"$f":"SUMIF($H$13:$H$39,EC13,$EB$13:$EB$39)","v":0},null,null,0]
[{"$nulls":5},{"v":2,"d":"02"},"H",12,10,40,400,7825,21,3500,860,"(3500)","","","","",{"$f":"IF($L14=\"?\",\"?\",IF(AND(H14<>\"\",K14<>\"\",AF14<>\"\",EG14=1),K14*AF14*(H14/2)^2*PI()*0.00000785,IF(AND(H14<>\"\",K14<>\"\",L14<>\"\"),K14*L14*(H14/2)^2*PI()*0.00000785,\"\")))","v":{"v":2778.858082621008,"d":"2778.9"}},{"$nulls":3},3500,860,3500,{"$nulls":5},{"$f":"IF(AU14>0,\"*\",\"\")","v":""},null,{"$f":"IF(OR(H14=\"\",M14=\"\"),\"\",IF(AF14>0,AF14,IF($M14=99,\"?\",INDEX(BW14:DF14,,MATCH(M14,$BW$12:$DF$12,0)))))","v":7825},{"$f":"IF(ISERROR(BI14),L14,IF(OR(H14=\"\",M14=\"\",AR14=0),\"\",IF(M14=99,IF(Y14=\"\",\"\",CEILING(Y14,5)),BI14)))","v":3500},{"$f":"IF(OR(H14=\"\",M14=\"\",M14=0,M14=1,AR14=0),\"\",IF(M14=99,IF(Z14=\"\",\"\",CEILING(Z14,5)),IF(OR(M14=11,M14=12),\"(\"&BK14&\")\",BK14)))","v":860},{"$f":"IF(OR(H14=\"\",M14=\"\",M14=0,M14=1,M14=11,M14=12,M14=75,AR14=0),\"\",IF(M14=99,IF(AA14=\"\",\"\",CEILING(AA14,5)),IF(OR(M14=13,M14=14,M14=15,M14=21,M14=23,M14=24,M14=26,M14=27,M14=28,M14=29,M14=33,M14=47,M14=48,M14=51,M14=52,M14=63),\"(\"&BM14&\")\",BM14)))","v":"(3500)"},{"$f":"IF(OR(H14=\"\",AR14=0,M14=\"\",M14=0,M14=1,M14=11,M14=12,M14=13,M14=21,M14=23,M14=33,M14=67,M14=75,M14=77,AND(AB14=\"\",$AU14=4)),\"\",IF(M14=99,IF(AB14=\"\",\"\",CEILING(AB14,5)),IF(OR(M14=22,M14=31,M14=32,M14=36,M14=47,M14=48,M14=51,M14=52,M14=56,M14=63,M14=98),\"(\"&BO14&\")\",BO14)))","v":""},{"$f":"IF(OR(H14=\"\",AR14=0,AND(AC14=\"\",$AU14=5)),\"\",IF(M14=99,IF(AC14=\"\",\"\",CEILING(AC14,5)),IF(OR(M14=24,M14=26,M14=27,M14=28,M14=29,M14=36,M14=64),BQ14,IF(OR(M14=25,M14=34,M14=35,M14=41,M14=44,M14=46,M14=56),\"(\"&BQ14&\")\",\"\"))))","v":""},{"$f":"IF(OR(H14=\"\",AR14=0,AND(AD14=\"\",$AU14=6)),\"\",IF(M14=99,IF(AD14=\"\",\"\",CEILING(AD14,5)),IF(OR(M14=34,M14=35,M14=36,M14=46),BS14,IF(OR(M14=56,M14=64),\"(\"&BS14&\")\",\"\"))))","v":""},{"$f":"IF(OR(H14=\"\",AR14=0),\"\",IF(M14=99,IF(AE14=\"\",\"\",CEILING(AE14,5)),IF(OR(M14=12,M14=67),BU14,\"\")))","v":""},null,{"$f":"IF(OR(M14=\"\",M14=0,M14=1,M14=11,M14=12,M14=13,M14=14,M14=15,M14=21,M14=22,M14=23,M14=24,M14=25,M14=26,M14=27,M14=28,M14=29,M14=31,M14=32,M14=33,M14=34,M14=35,M14=36,M14=41,M14=44,M14=46,M14=47,M14=48,M14=51,M14=52,M14=56,M14=63,M14=64,M14=67,M14=75,M14=77,M14=98,M14=99),1,0)","v":1},{"$f":"IF($AY$7=1,IF(OR($M14=14,$M14=15),1,IF(OR($M14=24,$M14=26,$M14=29),2,IF(OR($M14=27,$M14=28),1,IF(OR($M14=34,$M14=35,$M14=46),2,IF($M14=36,1,\"-\"))))),\nIF(OR($M14=14,$M14=15),2,IF(OR($M14=24,$M14=26,$M14=29),4,IF(OR($M14=27,$M14=28),4,IF(OR($M14=34,$M14=35,$M14=46),4,IF($M14=36,5,\"-\"))))))","v":"-"},{"$f":"IF($AY$7=1,IF(OR($M14=14,$M14=15),2,IF(OR($M14=24,$M14=26,$M14=29),4,IF(OR($M14=27,$M14=28),4,IF(OR($M14=34,$M14=35,$M14=46),4,IF($M14=36,5,\"-\"))))),\nIF(OR($M14=14,$M14=15),4,IF(OR($M14=24,$M14=26,$M14=29),5,IF(OR($M14=27,$M14=28),5,IF(OR($M14=34,$M14=35,$M14=46),6,IF($M14=36,6,\"-\"))))))","v":"-"},{"$f":"IF($AY$7=1,IF(OR(M14=14,M14=15),4,IF(OR(M14=24,M14=26,M14=27,M14=28,M14=29),5,IF(OR(M14=34,M14=35,M14=36,M14=46),6,0))),\nIF(OR(M14=14,M14=15,M14=27,M14=28,M14=36),1,IF(OR(M14=24,M14=26,M14=29,M14=34,M14=35,M14=46),2,0)))","v":0},{"$nulls":10},24,null,85,3500,0,860,0,3500,0,"",0,"",0,"",0,{"$f":"IF(OR(M14=12,M14=67),CEILING(MAX(AE14,BF14),5),IF(M14=99,0,\"\"))","v":""},0,{"$f":"IF($M14=BW$12,CEILING(BI14,25),\"\")","v":""},{"$f":"IF($M14=BX$12,CEILING(BI14,25),\"\")","v":""},"","","",null,null,7825,"","",{"$nulls":33},0,"A",{"$nulls":4},1,{"$nulls":7},{"$f":"IF(OR(K14=\"\",L14=\"\",L14=\"?\"),0,K14*L14/1000)","v":3130},7,0,null,null,0]
[{"$nulls":5},{"v":3,"d":"03"},"H",12,10,4,40,3500,11,2500,"(1000)","","","","","",{"v":124.29397174662657,"d":"124.3"},{"$nulls":3},2500,1000,{"$nulls":6},{"$f":"IF(AU15>0,\"*\",\"\")","v":""},null,{"$f":"IF(OR(H15=\"\",M15=\"\"),\"\",IF(AF15>0,AF15,IF($M15=99,\"?\",INDEX(BW15:DF15,,MATCH(M15,$BW$12:$DF$12,0)))))","v":3500},2500,"(1000)","","","","","",null,1,"-","-",0,{"$nulls":10},24,null,85,2500,0,1000,0,"",0,"",0,"",0,"",0,"",0,{"$f":"IF($M15=BW$12,CEILING(BI15,25),\"\")","v":""},{"$f":"IF($M15=BX$12,CEILING(BI15,25),\"\")","v":""},3500,"","",null,null,"","","",{"$nulls":33},1,"A (Stock Lengths)",{"$nulls":4},1,{"$nulls":7},140,8,0,null,null,0]
{"$rows_left_out":43}
{"sheet":"bar weights","index":1,"n_rows":70,"n_cols":41,"rows_kept":70,"merged":[[0,1,0,16],[0,17,0,32],[1,4,4,16],[1,17,3,23],[1,24,1,26],[1,27,1,32],[2,24,2,26],[2,27,2,32],[3,24,3,26],[3,27,3,32],[4,17,4,19],[4,20,4,23],[4,24,4,26],[4,27,4,32],[5,2,5,3],[5,4,5,16],[5,17,5,19],[5,20,5,23],[5,24,5,26],[5,27,5,32],[6,2,6,3],[6,4,6,16],[6,17,6,19],[6,20,6,23],[6,24,6,26],[6,27,6,32],[9,9,10,24],[11,9,12,11],[11,12,12,20],[11,21,12,24],[13,9,14,11],[13,12,14,20],[13,21,14,24],[15,9,16,11],[15,12,16,20],[15,21,16,24],[17,9,18,11],[17,12,18,20],[17,21,18,24],[19,9,20,11],[19,12,20,20],[19,21,20,24],[21,9,22,11],[21,12,22,20],[21,21,22,24],[23,9,24,11],[23,12,24,20],[23,21,24,24],[25,9,26,11],[25,12,26,20],[25,21,26,24],[27,9,28,11],[27,12,28,20],[27,21,28,24],[29,9,30,11],[29,12,30,20],[29,21,30,24],[31,9,32,11],[31,12,32,20],[31,21,32,24],[34,16,35,20],[34,21,35,24],[38,8,39,25],[42,2,42,31],[43,2,65,31],[67,12,68,23],[69,21,69,31]]}
[null,"Version: 3.1. - FREE LITE VERSION",{"$nulls":15},"© 2010-2021 Damian Janicki",{"$nulls":17},"global variables:"]
[{"$nulls":4},"YourSpreadsheets™\nYour Office Address Goes Here\nwww.YourSpreadsheets.co.uk\nTel: 010 1234 567890 (example only)",{"$nulls":12},{"$f":"IF('bar schedule'!N2=\"\",\"\",'bar schedule'!N2)","v":"86 MARGERY STREET, LONDON"},{"$nulls":6},"Status:",null,null,{"$f":"IF('bar schedule'!T2=\"\",\"\",'bar schedule'!T2)","v":"C"},{"$nulls":7},true,true,true,1]
[{"$nulls":24},"Drawing No:",null,null,{"$f":"IF('bar schedule'!T3=\"\",\"\",'bar schedule'!T3)","v":"A1/503"}]
[{"$nulls":24},"Sheet No:",null,null,{"$f":"IF('bar schedule'!T4=\"\",\"\",'bar schedule'!T4)","v":1}]
[{"$nulls":17},"Job No:",null,null,{"$f":"IF('bar schedule'!P5=\"\",\"\",'bar schedule'!P5)","v":22190},{"$nulls":3},"Revision:",null,null,{"$f":"IF('bar schedule'!T5=\"\",\"\",'bar schedule'!T5)","v":"A"}]
[null,null,"Section: ",null,"Summary of Bar weights",{"$nulls":12},"Prepared By:",null,null,{"$f":"IF('bar schedule'!P6=\"\",\"\",'bar schedule'!P6)","v":"DJ"},{"$nulls":3},"Date:",null,null,{"$f":"IF('bar schedule'!T6=\"\",\"\",'bar schedule'!T6)","v":"2021-05-31"}]
[null,null,"Location: ",null,{"$f":"IF('bar schedule'!E7=\"\",\"\",'bar schedule'!E7)","v":"Foundations"},{"$nulls":12},"Checked By:",null,null,{"$f":"IF('bar schedule'!P7=\"\",\"\",'bar schedule'!P7)","v":"DJ"},{"$nulls":3},"Last Revised:",null,null,{"$f":"IF('bar schedule'!T7=\"\",\"\",'bar schedule'!T7)","v":"2013-11-26"},{"$nulls":7},"bar diameter","total bar length per diametere [VBA column]","bar diameters used","counter","first 10 bar diameters to be summed","bar lengths"]
[{"$nulls":35},6,0,{"$f":"IF(AK8=0,\"\",AJ8)","v":""},1,{"$f":"IFERROR(SMALL($AL$8:$AL$52,AM8),\"\")","v":12},{"$f":"IFERROR(INDEX($AK$8:$AK$52,MATCH(AN8,$AJ$8:$AJ$52,0)),\"\")","v":7073.5}]
[{"$nulls":35},7,0,{"$f":"IF(AK9=0,\"\",AJ9)","v":""},2,"",""]
[{"$nulls":9},"Summary of bar lengths and weights",{"$nulls":25},8,0,"",3,"",""]
[{"$nulls":35},9,0,"",4,"",""]
[{"$nulls":9},"Bar size",null,null,"Total length [m]\n(of all bars in this size)",{"$nulls":8},"Weight [kg]",{"$nulls":13},10,0,"",5,"",""]
[{"$nulls":35},11,0,"",6,"",""]
[{"$nulls":9},{"$f":"AN8","v":12},null,null,{"$f":"AO8","v":{"v":7073.5,"d":"7073.500"}},{"$nulls":8},{"$f":"IF(J14=\"\",\"\",M14*(J14/2)^2*PI()*0.00785)","v":{"v":6279.952922498307,"d":"6279.953"}},{"$nulls":13},12,7073.5,12,7,"",""]
[{"$nulls":35},13,0,"",8,"",""]
{"$rows_left_out":43}
{"sheet":"shape codes","index":2,"n_rows":0,"n_cols":0,"rows_kept":0}

{"sheet":"template","index":3,"n_rows":20,"n_cols":17,"rows_kept":20,"hidden":true,"merged":[[3,3,3,5],[12,14,12,18],[19,4,22,17]]}
[26]
[1]
[]
[{"$nulls":3},"drawing size:",null,null,{"v":7,"d":"7   x"},7]
[]
[{"$nulls":4},"drawing area:",{"$nulls":9},"drawing tools:"]
[]
[{"$nulls":14},"dimension: ",null,"box: "]
[{"$nulls":14},"line: ",null,"arrow: "]
[{"$nulls":14},"bend: ",null,"arrow: "]
[{"$nulls":14},"text: ",null,"thread: "]
[]
[{"$nulls":14},"drag elemens into the drawing area and adjust"]
[]
[]
{"$rows_left_out":6}
{"sheet":"from author","index":4,"n_rows":46,"n_cols":14,"rows_kept":46,"merged":[[0,1,0,5],[0,6,0,10],[2,2,2,5],[2,6,2,9],[3,2,3,5],[3,6,3,9],[4,12,4,13],[6,2,9,9],[6,13,7,25],[12,2,30,9],[25,13,30,25],[34,2,41,9],[45,2,85,9]]}
[null,"Version: 3.1. - FREE LITE VERSION",{"$nulls":4},"© 2010-2021 Damian Janicki"]
[]
[null,null,"For latest updates and news visit:",{"$nulls":3},"Contact me at:"]
[null,null,"www.YourSpreadsheets.co.uk",{"$nulls":3},"info@yourspreadsheets.co.uk"]
[]
[]
[null,null,"General information:\nNOTE: This spreadsheet contains macros.\nAs this spreadsheets contains 'conditional formatting' it is recommended, when pasting data, to paste 'values only'. Furthermore to protect conditional formatting macro pasting 'values only' is assigned to Ctrl+v.",{"$nulls":10},"Video tutorial:\nIt is recommended to watch the video tutorial linked below to learn how to use the spreadsheet efficiently."]
[]
[]
[]
[]
[]
[null,null,"The Author takes no liability for use of this spreadsheet and gives no guarantee that it is error free. \n\nIn no event shall the Author be responsible for any special, incidental or consequential damages whatsoever arising from the use of this spreadsheet, even if the Author has been advised of the possibility of such damage.\n\nThis spreadsheet is a lite version and is a freeware and can be distributed freely but only in its original form.\n\nReverse-engineering, decompiling or disassembling of this spreadsheet is not allowed.\n\nBy using this spreadsheet you understand and agree with the above terms and conditions. You also acknowledge that you do not become the owner of this spreadsheet.\n\nDamian Janicki"]
{"$rows_empty":12}
[{"$nulls":13},"Keyboard shortcuts:\nCtrl + Shift + P to activate/deactivate pop-up window with Shapes Codes\nCtrl + Shift + N to activate/deactivate auto-jump to next input cell\nCtrl + Shift + E to activate/deactivate calculation of extra dimensions. In 'Settings' chose whether the extra dimension is horizontal or diagonal"]
{"$rows_left_out":4}